Reaction Details
TargetSerine/threonine-protein kinase pim-3
LigandBDBM225039
Substrate/Competitorn/a
Meas. Tech.Enzyme Assay
IC50 1.061±n/a nM
Citation Wang, HCee, VJHerberich, BJJackson, CLLanman, BANixey, TPettus, LHReed, ABWu, BWurz, RTasker, A Azole compounds as PIM inhibitors US Patent US9321756 Publication Date 4/26/2016
 
Serine/threonine-protein kinase pim-3
Name:Serine/threonine-protein kinase pim-3
Type:Protein
Mol. Mass.:35888.19
Organism:Homo sapiens (Human)
Description:Q86V86
Residue:326
BDBM225039
NameBDBM225039
Synonyms:US9321756, 1
TypeSmall organic molecule
Emp. Form.C20H21N7O
Mol. Mass.375.427
SMILESCC1CCCCN1c1cncc(n1)-c1c[nH]c2ccc(cc12)-c1nnc(N)o1