Reaction Details
TargetSerine/threonine-protein kinase pim-3
LigandBDBM224980
Substrate/Competitorn/a
Meas. Tech.Enzyme Assay
IC50 0.346±n/a nM
Citation Wang, HCee, VJHerberich, BJJackson, CLLanman, BANixey, TPettus, LHReed, ABWu, BWurz, RTasker, A Azole compounds as PIM inhibitors US Patent US9321756 Publication Date 4/26/2016
 
Serine/threonine-protein kinase pim-3
Name:Serine/threonine-protein kinase pim-3
Type:Protein
Mol. Mass.:35888.19
Organism:Homo sapiens (Human)
Description:Q86V86
Residue:326
BDBM224980
NameBDBM224980
Synonyms:US9321756, 247
TypeSmall organic molecule
Emp. Form.C20H19N7O
Mol. Mass.373.4112
SMILESC1CC1c1cncc(n1)-c1c[nH]c2ccc(cc12)-c1nnc(NC2CNC2)o1