Reaction Details
TargetIsoform PDE9A2 of High affinity cGMP-specific 3',5'-cyclic phosphodiesterase 9A (PDE9A2)
LigandBDBM224780
Substrate/Competitorn/a
Meas. Tech.Scintillation Proximity Assay
Temperature298.15±n/a K
IC50 13±n/a nM
Commentsextracted
Citation Heine, NEickmeier, CFerrera, MGiovannini, RRosenbrock, HSchaenzle, G 6-cycloalkyl-pyrazolopyrimidinones for the treatment of CNS disorders US Patent US9328120 Publication Date 5/3/2016
 
Isoform PDE9A2 of High affinity cGMP-specific 3',5'-cyclic phosphodiesterase 9A (PDE9A2)
Name:Isoform PDE9A2 of High affinity cGMP-specific 3',5'-cyclic phosphodiesterase 9A (PDE9A2)
Type:Protein
Mol. Mass.:61702.98
Organism:Homo sapiens (Human)
Description:O76083-2
Residue:533
BDBM224780
NameBDBM224780
Synonyms:US9328120, 10
TypeSmall organic molecule
Emp. Form.C18H21N5O2S
Mol. Mass.371.457
SMILESCc1nc(cs1)[C@@H]1CC[C@H]1c1nc2n(ncc2c(=O)[nH]1)C1CCOCC1