Reaction Details
TargetIsoform PDE9A2 of High affinity cGMP-specific 3',5'-cyclic phosphodiesterase 9A (PDE9A2)
LigandBDBM224799
Substrate/Competitorn/a
Meas. Tech.Scintillation Proximity Assay
Temperature298.15±n/a K
IC50 11±n/a nM
Commentsextracted
Citation Heine, NEickmeier, CFerrera, MGiovannini, RRosenbrock, HSchaenzle, G 6-cycloalkyl-pyrazolopyrimidinones for the treatment of CNS disorders US Patent US9328120 Publication Date 5/3/2016
 
Isoform PDE9A2 of High affinity cGMP-specific 3',5'-cyclic phosphodiesterase 9A (PDE9A2)
Name:Isoform PDE9A2 of High affinity cGMP-specific 3',5'-cyclic phosphodiesterase 9A (PDE9A2)
Type:Protein
Mol. Mass.:61702.98
Organism:Homo sapiens (Human)
Description:O76083-2
Residue:533
BDBM224799
NameBDBM224799
Synonyms:US9328120, 29
TypeSmall organic molecule
Emp. Form.C19H21N5O2
Mol. Mass.351.4023
SMILESO=c1[nH]c(nc2n(ncc12)C1CCOCC1)[C@@H]1CC[C@H]1c1ccccn1