Reaction Details
TargetCytochrome P450 1A2
LigandBDBM26197
Substrate/CompetitorUS9333197, Phenacetin
Meas. Tech.Inhibition Assay
IC50>25000±n/a nM
Citation Notte, G Apoptosis signal-regulating kinase inhibitor US Patent US9333197 Publication Date 5/10/2016
 
Cytochrome P450 1A2
Name:Cytochrome P450 1A2
Type:Enzyme
Mol. Mass.:58423.38
Organism:Homo sapiens (Human)
Description:P05177
Residue:516
BDBM26197
US9333197, Phenacetin
NameBDBM26197
Synonyms:CHEMBL112 Norco US9333197, Acetaminophen phenol derivative, 11
TypeSmall organic molecule
Emp. Form.C8H9NO2
Mol. Mass.151.1626
SMILESCC(=O)Nc1ccc(O)cc1