Reaction Details
TargetCarboxylic ester hydrolase
LigandBDBM225277
Substrate/Competitorn/a
Meas. Tech.Cholinesterase Activity Assay
pH8±n/a
Temperature298.15±n/a K
IC50 1.78e+4± 1.34e+3 nM
Commentsextracted
Citation Ozadali-Sari, KKüçükkilinç, TTAyazgok, BBalkan, AUnsal-Tan, O Novel multi-targeted agents for Alzheimer's disease: Synthesis, biological evaluation, and molecular modeling of novel 2-[4-(4-substitutedpiperazin-1-yl)phenyl]benzimidazoles Bioorg Chem72:208-214 (2017)  
 
Carboxylic ester hydrolase
Name:Carboxylic ester hydrolase
Type:Protein
Mol. Mass.:68842.83
Organism:Equus caballus (Horse)
Description:Q9N1N9
Residue:602
BDBM225277
NameBDBM225277
Synonyms:5-Methoxy-2-[4-(4-methylpiperazin-1-yl)phenyl]-1H-benzo[d] imidazole (3e)
TypeSmall organic molecule
Emp. Form.C19H22N4O
Mol. Mass.322.4042
SMILESCOc1ccc2[nH]c(nc2c1)-c1ccc(cc1)N1CCN(C)CC1