Reaction Details
TargetAcetylcholinesterase
LigandBDBM225274
Substrate/Competitorn/a
Meas. Tech.Cholinesterase Activity Assay
pH8±n/a
Temperature298.15±n/a K
IC50 3.485e+4± 1.17e+3 nM
Commentsextracted
Citation Ozadali-Sari, KKüçükkilinç, TTAyazgok, BBalkan, AUnsal-Tan, O Novel multi-targeted agents for Alzheimer's disease: Synthesis, biological evaluation, and molecular modeling of novel 2-[4-(4-substitutedpiperazin-1-yl)phenyl]benzimidazoles Bioorg Chem72:208-214 (2017)  
 
Acetylcholinesterase
Name:Acetylcholinesterase
Type:Enzyme
Mol. Mass.:67792.70
Organism:Homo sapiens (Human)
Description:P22303
Residue:614
BDBM225274
NameBDBM225274
Synonyms:2-[4-(4-Ethylpiperazin-1-yl)phenyl]-1H-benzo[d]imidazole (3b)
TypeSmall organic molecule
Emp. Form.C19H22N4
Mol. Mass.306.4048
SMILESCCN1CCN(CC1)c1ccc(cc1)-c1nc2ccccc2[nH]1