Reaction Details
TargetAcetylcholinesterase
LigandBDBM225277
Substrate/Competitorn/a
Meas. Tech.Cholinesterase Activity Assay
pH8±n/a
Temperature298.15±n/a K
IC50 2.293e+5± 1.81e+3 nM
Commentsextracted
Citation Ozadali-Sari, KKüçükkilinç, TTAyazgok, BBalkan, AUnsal-Tan, O Novel multi-targeted agents for Alzheimer's disease: Synthesis, biological evaluation, and molecular modeling of novel 2-[4-(4-substitutedpiperazin-1-yl)phenyl]benzimidazoles Bioorg Chem72:208-214 (2017)  
 
Acetylcholinesterase
Name:Acetylcholinesterase
Type:Enzyme
Mol. Mass.:67792.70
Organism:Homo sapiens (Human)
Description:P22303
Residue:614
BDBM225277
NameBDBM225277
Synonyms:5-Methoxy-2-[4-(4-methylpiperazin-1-yl)phenyl]-1H-benzo[d] imidazole (3e)
TypeSmall organic molecule
Emp. Form.C19H22N4O
Mol. Mass.322.4042
SMILESCOc1ccc2[nH]c(nc2c1)-c1ccc(cc1)N1CCN(C)CC1