Reaction Details
TargetAcetylcholinesterase
LigandBDBM225278
Substrate/Competitorn/a
Meas. Tech.Cholinesterase Activity Assay
pH8±n/a
Temperature298.15±n/a K
IC50 1.206e+5± 1.76e+3 nM
Commentsextracted
Citation Ozadali-Sari, KKüçükkilinç, TTAyazgok, BBalkan, AUnsal-Tan, O Novel multi-targeted agents for Alzheimer's disease: Synthesis, biological evaluation, and molecular modeling of novel 2-[4-(4-substitutedpiperazin-1-yl)phenyl]benzimidazoles Bioorg Chem72:208-214 (2017)  
 
Acetylcholinesterase
Name:Acetylcholinesterase
Type:Enzyme
Mol. Mass.:67792.70
Organism:Homo sapiens (Human)
Description:P22303
Residue:614
BDBM225278
NameBDBM225278
Synonyms:5-Methoxy-2-[4-(4-ethylpiperazin-1-yl)phenyl]-1H-benzo[d]imidazole (3f)
TypeSmall organic molecule
Emp. Form.C20H24N4O
Mol. Mass.336.4308
SMILESCCN1CCN(CC1)c1ccc(cc1)-c1nc2cc(OC)ccc2[nH]1