Reaction Details
TargetCyclin-dependent kinase 2
LigandBDBM91761
Substrate/Competitorn/a
Meas. Tech.OctetRed_Method1
Kd 229±69.4 nM
Citation D3R, DD CSAR CDK2 Kinase D3R D3R Publication Date 6/30/2015
 
Cyclin-dependent kinase 2
Name:Cyclin-dependent kinase 2
Type:Enzyme Subunit
Mol. Mass.:33938.17
Organism:Homo sapiens (Human)
Description:P24941
Residue:298
BDBM91761
NameBDBM91761
Synonyms:CS19
Typen/a
Emp. Form.C17H18N6O2S
Mol. Mass.370.429
SMILESCN(C)c1ccc(Nc2nccc(n2)-c2sc(C)nc2C)cc1[N+]([O-])=O