Reaction Details
TargetSerine/threonine-protein kinase Chk1 [2-280]
LigandBDBM91886
Substrate/Competitorn/a
Meas. Tech.33P-Radiometric_Method1
Ki 205±n/a nM
Citation D3R, DD Abbott CHK1 Kinase D3R D3R Publication Date 6/30/2015
 
Serine/threonine-protein kinase Chk1 [2-280]
Name:Serine/threonine-protein kinase Chk1 [2-280]
Type:n/a
Mol. Mass.:32109.16
Organism:Homo sapiens (Human)
Description:O14757[2-280]
Residue:279
BDBM91886
NameBDBM91886
Synonyms:Chk1_21
Typen/a
Emp. Form.C20H16N2O4
Mol. Mass.348.352
SMILESCOc1cc(ccc1O)-c1ccc2c(Nc3c(O)cccc3NC2=O)c1