Reaction Details
TargetSerine/threonine-protein kinase Chk1 [2-280]
LigandBDBM91906
Substrate/Competitorn/a
Meas. Tech.33P-Radiometric_Method1
Ki 1.36±n/a nM
Citation D3R, DD Abbott CHK1 Kinase D3R D3R Publication Date 6/30/2015
 
Serine/threonine-protein kinase Chk1 [2-280]
Name:Serine/threonine-protein kinase Chk1 [2-280]
Type:n/a
Mol. Mass.:32109.16
Organism:Homo sapiens (Human)
Description:O14757[2-280]
Residue:279
BDBM91906
NameBDBM91906
Synonyms:Chk1_40
Typen/a
Emp. Form.C17H17BrN6O2
Mol. Mass.417.26
SMILESOC1CCCN(C1)c1ccc(Br)cc1NC(=O)Nc1cnc(cn1)C#N