Reaction Details
TargetSerine/threonine-protein kinase Chk1 [2-280]
LigandBDBM225360
Substrate/Competitorn/a
Meas. Tech.33P-Radiometric_Method1
Ki 4.4±n/a nM
Citation D3R, DD Abbott CHK1 Kinase D3R D3R Publication Date 6/30/2015
 
Serine/threonine-protein kinase Chk1 [2-280]
Name:Serine/threonine-protein kinase Chk1 [2-280]
Type:n/a
Mol. Mass.:32109.16
Organism:Homo sapiens (Human)
Description:O14757[2-280]
Residue:279
BDBM225360
NameBDBM225360
Synonyms:Chk1_101
TypeSmall Organic Molecule
Emp. Form.C23H18N2O2
Mol. Mass.354.4012
SMILESOCc1ccc2Cc3c(n[nH]c3-c3ccc(cc3)-c3ccc(O)cc3)-c2c1