Reaction Details
TargetSerine/threonine-protein kinase Chk1 [2-280]
LigandBDBM91842
Substrate/Competitorn/a
Meas. Tech.33P-Radiometric_Method1
Ki 49.4±n/a nM
Citation D3R, DD Abbott CHK1 Kinase D3R D3R Publication Date 6/30/2015
 
Serine/threonine-protein kinase Chk1 [2-280]
Name:Serine/threonine-protein kinase Chk1 [2-280]
Type:n/a
Mol. Mass.:32109.16
Organism:Homo sapiens (Human)
Description:O14757[2-280]
Residue:279
BDBM91842
NameBDBM91842
Synonyms:Chk1_117
Typen/a
Emp. Form.C24H21N3O6
Mol. Mass.447.44
SMILESCOC(=O)Cc1ccc2Nc3cc(c(C)cc3C(=O)Nc2c1)-c1ccc(c(OC)c1)[N+]([O-])=O