Reaction Details
TargetSerine/threonine-protein kinase Chk1 [2-280]
LigandBDBM91866
Substrate/Competitorn/a
Meas. Tech.33P-Radiometric_Method1
Ki 5.26±n/a nM
Citation D3R, DD Abbott CHK1 Kinase D3R D3R Publication Date 6/30/2015
 
Serine/threonine-protein kinase Chk1 [2-280]
Name:Serine/threonine-protein kinase Chk1 [2-280]
Type:n/a
Mol. Mass.:32109.16
Organism:Homo sapiens (Human)
Description:O14757[2-280]
Residue:279
BDBM91866
NameBDBM91866
Synonyms:Chk1_143
Typen/a
Emp. Form.C27H22N4O5S
Mol. Mass.514.552
SMILESCOc1cc(ccc1[N+]([O-])=O)-c1ccc2c(Nc3cc(CC(=O)NCc4cccs4)ccc3NC2=O)c1