Reaction Details
TargetMitogen-activated protein kinase 1
LigandBDBM35654
Substrate/Competitorn/a
Meas. Tech.Photometric_Method2
Ki 1±n/a nM
Citation D3R, DD Vertex ERK2 D3R D3R Publication Date 6/30/2015
 
Mitogen-activated protein kinase 1
Name:Mitogen-activated protein kinase 1
Type:Ser/Thr Protein Kinase
Mol. Mass.:41392.76
Organism:Homo sapiens (Human)
Description:P28482
Residue:360
BDBM35654
NameBDBM35654
Synonyms:erk000526 | pyrimidylpyrrole, 11b
TypeSmall organic molecule
Emp. Form.C26H26ClN5O2
Mol. Mass.475.97
SMILESCc1cccc(Nc2ncc(C)c(n2)-c2c[nH]c(c2)C(=O)N[C@H](CO)c2cccc(Cl)c2)c1C