Reaction Details
TargetMalate synthase G [C619A]
LigandBDBM50083940
Substrate/Competitorn/a
Meas. Tech.DNTB-Coupled_Enzyme_Assay
IC50 170±n/a nM
Citation D3R, DD Sacchettini GlcB D3R D3R Publication Date 6/30/2015
 
Malate synthase G [C619A]
Name:Malate synthase G [C619A]
Type:n/a
Mol. Mass.:80350.85
Organism:Mycobacterium tuberculosis (strain CDC 1551 / Oshkosh)
Description:P9WK16[C619A]
Residue:741
BDBM50083940
NameBDBM50083940
Synonyms:4-(3-Chloro-phenyl)-2-hydroxy-4-oxo-but-2-enoic acid (0.2H2O) CHEMBL278763 | Sacchettini_6
TypeSmall organic molecule
Emp. Form.C10H7ClO4
Mol. Mass.226.613
SMILESOC(=O)C(=O)CC(=O)c1cccc(Cl)c1