Reaction Details
TargetTyrosine-protein kinase SYK [355-635]
LigandBDBM225538
Substrate/Competitorn/a
Meas. Tech.SYK assay_HTRF
IC50 1.58±n/a nM
Citation D3R, DD GSK SYK Kinase D3R D3R Publication Date 6/30/2015
 
Tyrosine-protein kinase SYK [355-635]
Name:Tyrosine-protein kinase SYK [355-635]
Type:n/a
Mol. Mass.:32610.83
Organism:Homo sapiens (Human)
Description:P43405[355-635]
Residue:281
BDBM225538
NameBDBM225538
Synonyms:GTC000242A
TypeSmall Organic Molecule
Emp. Form.C24H25FN8O
Mol. Mass.460.5067
SMILESCCN(c1cccc2[nH]ncc12)c1nc(Nc2ccc3c(C)nn(CCCO)c3c2)ncc1F