Reaction Details
TargetUrokinase-type plasminogen activator [179-424,C299A,N323Q]
LigandBDBM50147085
Substrate/Competitorn/a
Meas. Tech.Photometric_Method1
Ki 630±n/a nM
Citation D3R, DD Abbott Urokinase D3R D3R Publication Date 6/30/2015
 
Urokinase-type plasminogen activator [179-424,C299A,N323Q]
Name:Urokinase-type plasminogen activator [179-424,C299A,N323Q]
Type:n/a
Mol. Mass.:27687.84
Organism:Homo sapiens (Human)
Description:P00749[179-424,C299A,N323Q]
Residue:246
BDBM50147085
NameBDBM50147085
Synonyms:7-METHOXY-8-[1-(METHYLSULFONYL)-1H-PYRAZOL-4-YL]NAPHTHALENE-2-CARBOXIMIDAMIDE 8-(1-Methanesulfonyl-1H-pyrazol-4-yl)-7-methoxy-naphthalene-2-carboxamidine uPa_13
TypeSmall organic molecule
Emp. Form.C16H16N4O3S
Mol. Mass.344.388
SMILESCOc1ccc2ccc(cc2c1-c1cnn(c1)S(C)(=O)=O)C(N)=N