Reaction Details
TargetHeat shock protein HSP 90-beta
LigandBDBM225731
Substrate/Competitorn/a
Meas. Tech.Thermofluor Assay
Kd 993±26 nM
Citation D3R, DD AbbVie-CSAR HSP90 D3R D3R Publication Date 9/2/2016
 
Heat shock protein HSP 90-beta
Name:Heat shock protein HSP 90-beta
Type:Molecular Chaperone
Mol. Mass.:83229.45
Organism:Homo sapiens (Human)
Description:P08238
Residue:724
BDBM225731
NameBDBM225731
Synonyms:hsp90_24
TypeSmall Organic Molecule
Emp. Form.C22H20N2O6
Mol. Mass.408.404
SMILESCOc1cc(cc(OC)c1OC)-c1cc(c(O)cc1O)-n1c2ccccc2[nH]c1=O