Reaction Details
TargetHeat shock protein HSP 90-beta
LigandBDBM225743
Substrate/Competitorn/a
Meas. Tech.Thermofluor Assay
Kd 225±16 nM
Citation D3R, DD AbbVie-CSAR HSP90 D3R D3R Publication Date 9/2/2016
 
Heat shock protein HSP 90-beta
Name:Heat shock protein HSP 90-beta
Type:Molecular Chaperone
Mol. Mass.:83229.45
Organism:Homo sapiens (Human)
Description:P08238
Residue:724
BDBM225743
NameBDBM225743
Synonyms:hsp90_38
TypeSmall Organic Molecule
Emp. Form.C23H22ClN3O5S
Mol. Mass.487.956
SMILESCC(C)c1ccc(cc1)S(=O)(=O)NCc1ccc2n(-c3cc(Cl)c(O)cc3O)c(=O)[nH]c2c1