Reaction Details
TargetHeat shock protein HSP 90-beta
LigandBDBM225747
Substrate/Competitorn/a
Meas. Tech.ITC
Kd 26.8±3.98 nM
Citation D3R, DD AbbVie-CSAR HSP90 D3R D3R Publication Date 9/2/2016
 
Heat shock protein HSP 90-beta
Name:Heat shock protein HSP 90-beta
Type:Molecular Chaperone
Mol. Mass.:83229.45
Organism:Homo sapiens (Human)
Description:P08238
Residue:724
BDBM225747
NameBDBM225747
Synonyms:hsp90_44
TypeSmall Organic Molecule
Emp. Form.C19H15ClN4O5S
Mol. Mass.446.864
SMILESOc1cc(O)c(cc1Cl)-n1c2ccc(CNS(=O)(=O)c3cccnc3)cc2[nH]c1=O