Reaction Details
TargetHeat shock protein HSP 90-beta
LigandBDBM225796
Substrate/Competitorn/a
Meas. Tech.Thermofluor Assay
Kd 2250±459 nM
Citation D3R, DD AbbVie-CSAR HSP90 D3R D3R Publication Date 9/2/2016
 
Heat shock protein HSP 90-beta
Name:Heat shock protein HSP 90-beta
Type:Molecular Chaperone
Mol. Mass.:83229.45
Organism:Homo sapiens (Human)
Description:P08238
Residue:724
BDBM225796
NameBDBM225796
Synonyms:hsp90_87
TypeSmall Organic Molecule
Emp. Form.C11H7Cl3N4O
Mol. Mass.317.558
SMILESNc1nc(Cl)c(\C=N\O)c(n1)-c1ccc(Cl)cc1Cl