Reaction Details
TargetMitogen-activated protein kinase kinase kinase kinase 4
LigandBDBM225889
Substrate/Competitorn/a
Meas. Tech.Z'Lyte Assay
Ki 7.79±n/a nM
IC50 5.94±n/a nM
Citation D3R, DD Genentech MAP4K4 D3R D3R Publication Date 9/2/2016
 
Mitogen-activated protein kinase kinase kinase kinase 4
Name:Mitogen-activated protein kinase kinase kinase kinase 4
Type:Serine/threonine-protein kinase
Mol. Mass.:142114.73
Organism:Homo sapiens (Human)
Description:O95819
Residue:1239
BDBM225889
NameBDBM225889
Synonyms:MAP07
TypeSmall Organic Molecule
Emp. Form.C17H14ClN3O
Mol. Mass.311.766
SMILESClc1ccccc1-c1cc2cc(NC(=O)C3CC3)ncc2[nH]1