Reaction Details
TargetMitogen-activated protein kinase kinase kinase kinase 4
LigandBDBM50011564
Substrate/Competitorn/a
Meas. Tech.Z'Lyte Assay
Ki 108±n/a nM
IC50 92.7±n/a nM
Citation D3R, DD Genentech MAP4K4 D3R D3R Publication Date 9/2/2016
 
Mitogen-activated protein kinase kinase kinase kinase 4
Name:Mitogen-activated protein kinase kinase kinase kinase 4
Type:Serine/threonine-protein kinase
Mol. Mass.:142114.73
Organism:Homo sapiens (Human)
Description:O95819
Residue:1239
BDBM50011564
NameBDBM50011564
Synonyms:CHEMBL3262583 US9592235, Example 158 | US9855269, Compound 1
TypeSmall organic molecule
Emp. Form.C14H10ClN3
Mol. Mass.255.702
SMILESNc1ncnc2ccc(cc12)-c1cccc(Cl)c1