Reaction Details
TargetMitogen-activated protein kinase kinase kinase kinase 4
LigandBDBM225894
Substrate/Competitorn/a
Meas. Tech.Z'Lyte Assay
Ki 2550±n/a nM
IC50 1740±n/a nM
Citation D3R, DD Genentech MAP4K4 D3R D3R Publication Date 9/2/2016
 
Mitogen-activated protein kinase kinase kinase kinase 4
Name:Mitogen-activated protein kinase kinase kinase kinase 4
Type:Serine/threonine-protein kinase
Mol. Mass.:142114.73
Organism:Homo sapiens (Human)
Description:O95819
Residue:1239
BDBM225894
NameBDBM225894
Synonyms:MAP13
TypeSmall Organic Molecule
Emp. Form.C21H16F2N6O2
Mol. Mass.422.3875
SMILESCNC(=O)c1ccc2-c3cc(nn3CCOc2c1)-c1ncnn1-c1ccc(F)cc1F