Reaction Details
TargetBile acid receptor
LigandBDBM225915
Substrate/Competitorn/a
Meas. Tech.Scintillation Proximity Assay (SPA)
pH7.4±n/a
IC50 263000±n/a nM
Commentsextracted
Citation D3R, DD Drug Design Data Resource Grand Challenge 2 Dataset: FXR - Farnesoid X Receptor D3R D3R Publication Date 4/13/2017
 
Bile acid receptor
Name:Bile acid receptor
Type:Nuclear Receptor
Mol. Mass.:55916.24
Organism:Homo sapiens (Human)
Description:Q96RI1
Residue:486
BDBM225915
NameBDBM225915
Synonyms:FXR_3
TypeSmall Organic Molecule
Emp. Form.C22H29FN2O2
Mol. Mass.372.4763
SMILESFc1ccc(\C=C\C(=O)N(C2CCCCC2)C(=O)NC2CCCCC2)cc1