Reaction Details
TargetBile acid receptor
LigandBDBM225918
Substrate/Competitorn/a
Meas. Tech.Scintillation Proximity Assay (SPA)
pH7.4±n/a
IC50 239±n/a nM
Commentsextracted
Citation D3R, DD Drug Design Data Resource Grand Challenge 2 Dataset: FXR - Farnesoid X Receptor D3R D3R Publication Date 4/13/2017
 
Bile acid receptor
Name:Bile acid receptor
Type:Nuclear Receptor
Mol. Mass.:55916.24
Organism:Homo sapiens (Human)
Description:Q96RI1
Residue:486
BDBM225918
NameBDBM225918
Synonyms:FXR_7
TypeSmall Organic Molecule
Emp. Form.C31H35N3OS
Mol. Mass.497.694
SMILESO=C(NC1CCCCC1)[C@H](C1CCCCC1)n1c(nc2ccccc12)-c1ccc(s1)-c1ccccc1