Reaction Details
TargetBile acid receptor
LigandBDBM225927
Substrate/Competitorn/a
Meas. Tech.Scintillation Proximity Assay (SPA)
pH7.4±n/a
IC50 29000±n/a nM
Commentsextracted
Citation D3R, DD Drug Design Data Resource Grand Challenge 2 Dataset: FXR - Farnesoid X Receptor D3R D3R Publication Date 4/13/2017
 
Bile acid receptor
Name:Bile acid receptor
Type:Nuclear Receptor
Mol. Mass.:55916.24
Organism:Homo sapiens (Human)
Description:Q96RI1
Residue:486
BDBM225927
NameBDBM225927
Synonyms:FXR_16
TypeSmall Organic Molecule
Emp. Form.C21H23N3O3S2
Mol. Mass.429.556
SMILESCC(C)NC(=O)n1c2CN(CCc2cc1-c1ccccc1)S(=O)(=O)c1cccs1