Reaction Details
TargetBile acid receptor
LigandBDBM225960
Substrate/Competitorn/a
Meas. Tech.Scintillation Proximity Assay (SPA)
pH7.4±n/a
IC50 10300±n/a nM
Commentsextracted
Citation D3R, DD Drug Design Data Resource Grand Challenge 2 Dataset: FXR - Farnesoid X Receptor D3R D3R Publication Date 4/13/2017
 
Bile acid receptor
Name:Bile acid receptor
Type:Nuclear Receptor
Mol. Mass.:55916.24
Organism:Homo sapiens (Human)
Description:Q96RI1
Residue:486
BDBM225960
NameBDBM225960
Synonyms:FXR_50
TypeSmall Organic Molecule
Emp. Form.C24H24ClF2N3O
Mol. Mass.443.917
SMILESFc1cc2nc(-c3ccc(Cl)cc3)n([C@@H](C3CCCCC3)C(=O)NC3CC3)c2cc1F