Reaction Details
TargetBile acid receptor
LigandBDBM225973
Substrate/Competitorn/a
Meas. Tech.Scintillation Proximity Assay (SPA)
pH7.4±n/a
IC50 20800±n/a nM
Commentsextracted
Citation D3R, DD Drug Design Data Resource Grand Challenge 2 Dataset: FXR - Farnesoid X Receptor D3R D3R Publication Date 4/13/2017
 
Bile acid receptor
Name:Bile acid receptor
Type:Nuclear Receptor
Mol. Mass.:55916.24
Organism:Homo sapiens (Human)
Description:Q96RI1
Residue:486
BDBM225973
NameBDBM225973
Synonyms:FXR_66
TypeSmall Organic Molecule
Emp. Form.C30H36F2N4O5
Mol. Mass.570.6274
SMILESCOc1ccc(-c2nc3cc(F)c(F)cc3n2[C@@H](C2CCCCC2)C(=O)N[C@@H]2CC[C@H](CC(O)=O)CC2)c(OC)n1