Reaction Details
TargetBile acid receptor
LigandBDBM225982
Substrate/Competitorn/a
Meas. Tech.Scintillation Proximity Assay (SPA)
pH7.4±n/a
IC50>100000±n/a nM
Commentsextracted
Citation D3R, DD Drug Design Data Resource Grand Challenge 2 Dataset: FXR - Farnesoid X Receptor D3R D3R Publication Date 4/13/2017
 
Bile acid receptor
Name:Bile acid receptor
Type:Nuclear Receptor
Mol. Mass.:55916.24
Organism:Homo sapiens (Human)
Description:Q96RI1
Residue:486
BDBM225982
NameBDBM225982
Synonyms:FXR_75
TypeSmall Organic Molecule
Emp. Form.C22H20BrN3O3S2
Mol. Mass.518.447
SMILESBrc1ccc2N(Cc3ccncc3)C(=O)C3(CCN(CC3)S(=O)(=O)c3cccs3)c2c1