Reaction Details
TargetBile acid receptor
LigandBDBM225991
Substrate/Competitorn/a
Meas. Tech.Scintillation Proximity Assay (SPA)
pH7.4±n/a
IC50 4540±n/a nM
Commentsextracted
Citation D3R, DD Drug Design Data Resource Grand Challenge 2 Dataset: FXR - Farnesoid X Receptor D3R D3R Publication Date 4/13/2017
 
Bile acid receptor
Name:Bile acid receptor
Type:Nuclear Receptor
Mol. Mass.:55916.24
Organism:Homo sapiens (Human)
Description:Q96RI1
Residue:486
BDBM225991
NameBDBM225991
Synonyms:FXR_84
TypeSmall Organic Molecule
Emp. Form.C26H22BrFN2O5S
Mol. Mass.573.431
SMILESOC(=O)c1ccc(CN2C(=O)C3(CCN(CC3)S(=O)(=O)c3ccccc3F)c3cc(Br)ccc23)cc1