Reaction Details
TargetBile acid receptor
LigandBDBM226009
Substrate/Competitorn/a
Meas. Tech.Scintillation Proximity Assay (SPA)
pH7.4±n/a
IC50 29200±n/a nM
Commentsextracted
Citation D3R, DD Drug Design Data Resource Grand Challenge 2 Dataset: FXR - Farnesoid X Receptor D3R D3R Publication Date 4/13/2017
 
Bile acid receptor
Name:Bile acid receptor
Type:Nuclear Receptor
Mol. Mass.:55916.24
Organism:Homo sapiens (Human)
Description:Q96RI1
Residue:486
BDBM226009
NameBDBM226009
Synonyms:FXR_102
TypeSmall Organic Molecule
Emp. Form.C28H27N5O5S2
Mol. Mass.577.674
SMILESO=C(Nc1ccc(cc1)C(=O)N1CCOCC1)c1c2CN(CCc2nn1-c1ccccc1)S(=O)(=O)c1cccs1