Reaction Details
TargetHistamine H1 receptor
LigandBDBM50073179
Substrate/Competitorn/a
Meas. Tech.Binding Assay
IC50 16000±n/a nM
Citation Aberg, AKCiofalo, VB Methods of treatment of histamine H-4 receptor-related pruritus associated with nerve disorders US Patent US9333199 Publication Date 5/10/2016
 
Histamine H1 receptor
Name:Histamine H1 receptor
Type:G Protein-Coupled Receptor (GPCR)
Mol. Mass.:55808.72
Organism:Homo sapiens (Human)
Description:Cell pellets from SK-N-MC cells transfected with human H1 receptor were used in binding assay.
Residue:487
BDBM50073179
NameBDBM50073179
Synonyms:8-Chloro-11-piperidin-4-ylidene-6,11-dihydro-5H-benzo[5,6]cyclohepta[1,2-b]pyridine Clarinex Claritin-D SCH-34117 US9333199, DESLORATADINE (Clarinex)
TypeSmall organic molecule
Emp. Form.C19H19ClN2
Mol. Mass.310.821
SMILESClc1ccc2c(-[#6]-[#6]-c3cccnc3\[#6]-2=[#6]-2/[#6]-[#6]-[#7]-[#6]-[#6]-2)c1