Reaction Details
TargetPhosphatidylinositol 4,5-bisphosphate 3-kinase catalytic subunit delta isoform
LigandBDBM291354
Substrate/Competitorn/a
Meas. Tech.Biochemical Assay
IC50 15.0±n/a nM
Citation Shuttleworth, SJLiam Cecil, ARHill, TJSilva, FA Tricyclic heterocyclic compounds as phosphoinositide 3-kinase inhibitors US Patent US9580442 Publication Date 2/28/2017
 
Phosphatidylinositol 4,5-bisphosphate 3-kinase catalytic subunit delta isoform
Name:Phosphatidylinositol 4,5-bisphosphate 3-kinase catalytic subunit delta isoform
Type:Enzyme Subunit
Mol. Mass.:119489.41
Organism:Homo sapiens (Human)
Description:O00329
Residue:1044
BDBM291354
NameBDBM291354
Synonyms:2-(1H-Indol-4-yl)-4-morpholin-4-yl-pyrido[3′,2′:4,5]thieno[3,2-d]pyrimidine US9938290, A
TypeSmall organic molecule
Emp. Form.C21H17N5OS
Mol. Mass.387.458
SMILESC1CN(CCO1)c1nc(nc2c3cccnc3sc12)-c1cccc2[nH]ccc12