Reaction Details
TargetPhosphatidylinositol 4,5-bisphosphate 3-kinase catalytic subunit gamma isoform
LigandBDBM291360
Substrate/Competitorn/a
Meas. Tech.Biochemical Assay
IC50 213±n/a nM
Citation Shuttleworth, SJLiam Cecil, ARHill, TJSilva, FA Tricyclic heterocyclic compounds as phosphoinositide 3-kinase inhibitors US Patent US9580442 Publication Date 2/28/2017
 
Phosphatidylinositol 4,5-bisphosphate 3-kinase catalytic subunit gamma isoform
Name:Phosphatidylinositol 4,5-bisphosphate 3-kinase catalytic subunit gamma isoform
Type:Enzyme Subunit
Mol. Mass.:126470.30
Organism:Homo sapiens (Human)
Description:P48736
Residue:1102
BDBM291360
NameBDBM291360
Synonyms:US9580442, Example H [2-(1H-Indol-4-yl)-4-morpholin-4-yl-pyrido[3′,2′:4,5]furo[3,2-d]pyrimidin-8-ylmethyl]-dimethyl-amine
TypeSmall organic molecule
Emp. Form.C24H24N6O2
Mol. Mass.428.4864
SMILESCN(C)Cc1cnc2oc3c(nc(nc3c2c1)-c1cccc2[nH]ccc12)N1CCOCC1