Reaction Details
TargetMuscarinic acetylcholine receptor M3
LigandBDBM50296329
Substrate/Competitorn/a
Meas. Tech.[3H]-NMS Binding Assay
IC50 2.7±n/a nM
Citation Fernandez Forner, MDPrat Quinones, MBuil Albero, MA Quinuclidine derivatives and medicinal compositions containing the same US Patent US9333195 Publication Date 5/10/2016
 
Muscarinic acetylcholine receptor M3
Name:Muscarinic acetylcholine receptor M3
Type:Enzyme
Mol. Mass.:66151.03
Organism:Homo sapiens (Human)
Description:P20309
Residue:590
BDBM50296329
NameBDBM50296329
Synonyms:(3R)-3-{[Hydroxy(di-2-thienyl)acetyl]oxy}-1-(2-phenylethyl)-1-azoniabicyclo[2.2.2]octane bromide US9333195, 36 | US9687478, 36
TypeSmall organic molecule
Emp. Form.C25H28NO3S2
Mol. Mass.454.624
SMILESOC(C(=O)O[C@H]1C[N+]2(CCc3ccccc3)CCC1CC2)(c1cccs1)c1cccs1