Reaction Details
TargetBeta-glucuronidase
LigandBDBM163636
Substrate/Competitorn/a
Meas. Tech.Activity Assay
IC50 282.5±26.05 nM
Citation Redinbo, MR Selective β-glucuronidase inhibitors as a treatment for side effects of camptothecin antineoplastic agents US Patent US9334288 Publication Date 5/10/2016
 
Beta-glucuronidase
Name:Beta-glucuronidase
Type:Protein
Mol. Mass.:74736.05
Organism:Homo sapiens (Human)
Description:n/a
Residue:651
BDBM163636
NameBDBM163636
Synonyms:3[(6,8Dimethyl2oxo1,2dihydroquinolin3 yl)methyl]1(4ethoxyphenyl)3(2hydroxyethyl)thiourea (Inh 1) | US9334288, 1
TypeSmall organic molecule
Emp. Form.C23H27N3O3S
Mol. Mass.425.544
SMILESCCOc1ccc(NC(=S)N(CCO)Cc2cc3cc(C)cc(C)c3[nH]c2=O)cc1