Reaction Details
TargetBeta-glucuronidase
LigandBDBM163640
Substrate/Competitorn/a
Meas. Tech.Activity Assay
IC50 230.6±1.17 nM
Citation Redinbo, MR Selective β-glucuronidase inhibitors as a treatment for side effects of camptothecin antineoplastic agents US Patent US9334288 Publication Date 5/10/2016
 
Beta-glucuronidase
Name:Beta-glucuronidase
Type:Protein
Mol. Mass.:74736.05
Organism:Homo sapiens (Human)
Description:n/a
Residue:651
BDBM163640
NameBDBM163640
Synonyms:5,11Dimethyl3(piperazin1yl)8thia4,6diazatricyclo[7.4.0.0²,⁷]trideca1(9),2(7),3,5tetraene (Inh 5) | US9334288, 5
TypeSmall organic molecule
Emp. Form.C16H22N4S
Mol. Mass.302.438
SMILESCC1CCc2c(C1)sc1nc(C)nc(N3CCNCC3)c21