Reaction Details
TargetBeta-glucuronidase
LigandBDBM229594
Substrate/Competitorn/a
Meas. Tech.Activity Assay
EC50 233.2±2.99 nM
Citation Redinbo, MR Selective β-glucuronidase inhibitors as a treatment for side effects of camptothecin antineoplastic agents US Patent US9334288 Publication Date 5/10/2016
 
Beta-glucuronidase
Name:Beta-glucuronidase
Type:Protein
Mol. Mass.:74736.05
Organism:Homo sapiens (Human)
Description:n/a
Residue:651
BDBM229594
NameBDBM229594
Synonyms:US9334288, 2
TypeSmall organic molecule
Emp. Form.C20H20FN3O3
Mol. Mass.369.3895
SMILESCc1ccc2[nH]c(=O)c(CN(CCO)C(=O)Nc3ccccc3F)cc2c1