Reaction Details
TargetBeta-glucuronidase
LigandBDBM163642
Substrate/Competitorn/a
Meas. Tech.Cell-Based Assay
IC50 1688.9±24.12 nM
Citation Redinbo, MR Selective β-glucuronidase inhibitors as a treatment for side effects of camptothecin antineoplastic agents US Patent US9334288 Publication Date 5/10/2016
 
Beta-glucuronidase
Name:Beta-glucuronidase
Type:Protein
Mol. Mass.:74736.05
Organism:Homo sapiens (Human)
Description:n/a
Residue:651
BDBM163642
NameBDBM163642
Synonyms:Methyl 2amino5[(3chloro4methylphenyl)carbamoyl]4methylthiophene3carboxylate (Inh 7) | US9334288, 3
TypeSmall organic molecule
Emp. Form.C15H15ClN2O3S
Mol. Mass.338.809
SMILESCOC(=O)c1c(N)sc(C(=O)Nc2ccc(C)c(Cl)c2)c1C