Reaction Details
TargetBeta-glucuronidase
LigandBDBM229595
Substrate/Competitorn/a
Meas. Tech.Cell-Based Assay
IC50 0.984±0.37 nM
Citation Redinbo, MR Selective β-glucuronidase inhibitors as a treatment for side effects of camptothecin antineoplastic agents US Patent US9334288 Publication Date 5/10/2016
 
Beta-glucuronidase
Name:Beta-glucuronidase
Type:Protein
Mol. Mass.:74736.05
Organism:Homo sapiens (Human)
Description:n/a
Residue:651
BDBM229595
NameBDBM229595
Synonyms:US9334288, 9
TypeSmall organic molecule
Emp. Form.C20H25N7OS
Mol. Mass.411.524
SMILESC1CCc2c(C1)c(nc1sc3c(nnnc3c21)N1CCNCC1)N1CCOCC1