Reaction Details
TargetDual specificity protein kinase TTK
LigandBDBM230885
Substrate/Competitorn/a
Meas. Tech.Kinase Assay
pH7±n/a
Temperature298.15±n/a K
IC50 2±n/a nM
Commentsextracted
Citation Hoelder, SBlagg, JCheung, KJAtrash, BSheldrake, P Pharmacologically active compounds US Patent US9334286 Publication Date 5/10/2016
 
Dual specificity protein kinase TTK
Name:Dual specificity protein kinase TTK
Type:Protein
Mol. Mass.:97086.79
Organism:Homo sapiens (Human)
Description:P33981
Residue:857
BDBM230885
NameBDBM230885
Synonyms:US10188642, Example 11 | US9334286, 11
TypeSmall organic molecule
Emp. Form.C27H25N5O
Mol. Mass.435.5203
SMILESCOc1cc(ccc1Nc1cc2cc(ccc2cn1)-c1ccc(C)nc1)-c1cnc(C)n1C