Reaction Details
TargetProteinase-activated receptor 1
LigandBDBM230673
Substrate/Competitorn/a
Meas. Tech.FLIPR Assay
IC50 3.4±n/a nM
Citation Mandal, MBlizzard, TAChen, HChobanian, HGuo, YPio, BWu, ZBiftu, TGreenlee, WJZhu, JZ Preparation and use of bicyclic himbacine derivatives as PAR-1 receptor antagonists US Patent US9340530 Publication Date 5/17/2016
 
Proteinase-activated receptor 1
Name:Proteinase-activated receptor 1
Type:Protein
Mol. Mass.:47450.07
Organism:Homo sapiens (Human)
Description:P25116
Residue:425
BDBM230673
NameBDBM230673
Synonyms:US9340530, 11
TypeSmall organic molecule
Emp. Form.C25H24F3NO4
Mol. Mass.459.4576
SMILESCOC(=O)[C@@]12CC(F)(F)[C@@H](C)[C@H](\C=C\c3ccc(cn3)-c3cccc(F)c3)C1[C@@H](C)OC2=O