Reaction Details
TargetProteinase-activated receptor 1
LigandBDBM230686
Substrate/Competitorn/a
Meas. Tech.FLIPR Assay
IC50 1.9±n/a nM
Citation Mandal, MBlizzard, TAChen, HChobanian, HGuo, YPio, BWu, ZBiftu, TGreenlee, WJZhu, JZ Preparation and use of bicyclic himbacine derivatives as PAR-1 receptor antagonists US Patent US9340530 Publication Date 5/17/2016
 
Proteinase-activated receptor 1
Name:Proteinase-activated receptor 1
Type:Protein
Mol. Mass.:47450.07
Organism:Homo sapiens (Human)
Description:P25116
Residue:425
BDBM230686
NameBDBM230686
Synonyms:US9340530, 22a | US9340530, 22b
TypeSmall organic molecule
Emp. Form.C28H25F2N3O4
Mol. Mass.505.5126
SMILESC[C@H]1OC(=O)[C@@]2(CC(F)(F)C(C)[C@H](\C=C\c3ccc(cn3)-c3ccccc3C#N)C12)C(O)c1cocn1