Reaction Details
TargetProteinase-activated receptor 1
LigandBDBM230691
Substrate/Competitorn/a
Meas. Tech.FLIPR Assay
IC50 3.3±n/a nM
Citation Mandal, MBlizzard, TAChen, HChobanian, HGuo, YPio, BWu, ZBiftu, TGreenlee, WJZhu, JZ Preparation and use of bicyclic himbacine derivatives as PAR-1 receptor antagonists US Patent US9340530 Publication Date 5/17/2016
 
Proteinase-activated receptor 1
Name:Proteinase-activated receptor 1
Type:Protein
Mol. Mass.:47450.07
Organism:Homo sapiens (Human)
Description:P25116
Residue:425
BDBM230691
NameBDBM230691
Synonyms:US9340530, 25
TypeSmall organic molecule
Emp. Form.C25H23ClF2N2O2
Mol. Mass.456.912
SMILESC[C@H]1OC(=O)[C@]2(CC#N)CC(F)(F)[C@@H](C)[C@H](\C=C\c3ccc(cn3)-c3ccccc3Cl)C12