Reaction Details
TargetProteinase-activated receptor 1
LigandBDBM230694
Substrate/Competitorn/a
Meas. Tech.FLIPR Assay
IC50 0.9±n/a nM
Citation Mandal, MBlizzard, TAChen, HChobanian, HGuo, YPio, BWu, ZBiftu, TGreenlee, WJZhu, JZ Preparation and use of bicyclic himbacine derivatives as PAR-1 receptor antagonists US Patent US9340530 Publication Date 5/17/2016
 
Proteinase-activated receptor 1
Name:Proteinase-activated receptor 1
Type:Protein
Mol. Mass.:47450.07
Organism:Homo sapiens (Human)
Description:P25116
Residue:425
BDBM230694
NameBDBM230694
Synonyms:US9340530, 28
TypeSmall organic molecule
Emp. Form.C27H26ClF2N3O3
Mol. Mass.513.963
SMILESC[C@H]1OC(=O)[C@]2(Cc3nnc(C)o3)CC(F)(F)[C@@H](C)[C@H](\C=C\c3ccc(cn3)-c3ccccc3Cl)C12