Reaction Details
TargetProteinase-activated receptor 1
LigandBDBM230698
Substrate/Competitorn/a
Meas. Tech.FLIPR Assay
IC50 1.4±n/a nM
Citation Mandal, MBlizzard, TAChen, HChobanian, HGuo, YPio, BWu, ZBiftu, TGreenlee, WJZhu, JZ Preparation and use of bicyclic himbacine derivatives as PAR-1 receptor antagonists US Patent US9340530 Publication Date 5/17/2016
 
Proteinase-activated receptor 1
Name:Proteinase-activated receptor 1
Type:Protein
Mol. Mass.:47450.07
Organism:Homo sapiens (Human)
Description:P25116
Residue:425
BDBM230698
NameBDBM230698
Synonyms:US9340530, 32
TypeSmall organic molecule
Emp. Form.C27H25F2N5O2
Mol. Mass.489.5165
SMILESC[C@H]1OC(=O)[C@@]2(CC(F)(F)C(C)[C@H](\C=C\c3ccc(cn3)-c3ccccc3C#N)C12)n1cc(C)nn1