Reaction Details
TargetProteinase-activated receptor 1
LigandBDBM230738
Substrate/Competitorn/a
Meas. Tech.FLIPR Assay
IC50 3.3±n/a nM
Citation Mandal, MBlizzard, TAChen, HChobanian, HGuo, YPio, BWu, ZBiftu, TGreenlee, WJZhu, JZ Preparation and use of bicyclic himbacine derivatives as PAR-1 receptor antagonists US Patent US9340530 Publication Date 5/17/2016
 
Proteinase-activated receptor 1
Name:Proteinase-activated receptor 1
Type:Protein
Mol. Mass.:47450.07
Organism:Homo sapiens (Human)
Description:P25116
Residue:425
BDBM230738
NameBDBM230738
Synonyms:US9340530, 73
TypeSmall organic molecule
Emp. Form.C25H25F2N3O2
Mol. Mass.437.4817
SMILESC[C@H]1OC(=O)[C@]2(N)CC(F)(F)[C@@H](C)[C@H](\C=C\c3ccc(cn3)-c3cccc(C)c3C#N)C12